{"text_format":"1","workbook":"xlsx","n_sheets":3,"sheets":["TGCF 2016","Prerrequisitos","Cómo voy"],"not_rendered":{"charts":0,"images":0,"macros":1,"external_links":0,"defined_names":0,"comments":0,"pivot_tables":0},"unopened":[],"bounds":{"document_bytes":16777216,"sheet_cells":100000,"rows_first":2000,"rows_last":500,"rows_between":2000,"halvings":0,"cell_chars":16384,"cell_head_chars":4096},"cells_cut":0,"cells_raw":0,"read":"whole","date_system":"1900"}

{"sheet":"TGCF 2016","index":0,"n_rows":37,"n_cols":29,"rows_kept":37,"cut":false,"hidden":false,"merged":[[35,26,35,29],[36,26,36,29],[13,2,13,4],[12,2,12,3],[16,2,16,3],[17,2,17,4],[20,2,20,3],[21,2,21,4],[24,2,24,3],[25,2,25,4],[28,2,28,3],[29,2,29,4],[32,2,32,3],[33,2,34,4],[12,6,12,7],[13,6,13,8],[16,6,16,7],[17,6,17,8],[20,6,20,7],[21,6,21,8],[24,6,24,7],[25,6,25,8],[28,6,28,7],[29,6,29,8],[32,6,32,7],[33,6,34,8],[12,12,12,13],[12,16,12,17],[13,12,13,14],[13,16,13,18],[16,12,16,13],[16,16,16,17],[17,12,17,14],[17,16,17,18],[20,12,20,13],[20,16,20,17],[21,12,21,14],[21,16,21,18],[24,12,24,13],[24,16,24,17],[25,12,25,14],[33,12,34,14],[33,16,34,18],[32,12,32,13],[32,16,32,17],[25,16,25,18],[28,12,28,13],[28,16,28,17],[29,12,29,14],[29,16,29,18],[34,26,34,29],[21,26,21,28],[12,26,12,27],[13,26,13,28],[16,26,16,27],[28,26,28,27],[9,1,9,29],[28,20,28,21],[29,20,29,22],[32,20,32,21],[34,20,34,22],[12,20,12,21],[13,20,13,22],[16,20,16,21],[17,20,17,22],[20,20,20,21],[21,20,21,22],[29,26,29,28],[24,26,24,27],[25,26,25,28],[17,26,17,28],[20,26,20,27]]}
[]
[]
[]
[]
[]
[]
[]
[]
[]
[null,"Lleva el control de tu avance curricular"]
[]
[]
[null,null,"CBAS-1113",null,{"$f":"MAX(C15:E15)","v":0},null,"CBAS-1123",null,{"$f":"MAX(G15:I15)","v":0},null,null,null,"TPOT-1013",null,{"$f":"MAX(M15:O15)","v":0},null,"TPCO-1253",null,{"$f":"MAX(Q15:S15)","v":0},null,"TPCO-1213",null,{"$f":"MAX(U15:W15)","v":0},null,null,null,"TCFV-1003",null,{"$f":"MAX(AA15:AC15)","v":0}]
[null,null,"Aplicaciones Estadísticas ",null,null,null,"Aplicaciones Matemáticas ",null,null,null,null,null,"Análisis de Precios y Mercados",null,null,null,"Aplicaciones Tributarias ",null,null,null,"Control de Inventarios ",null,null,null,null,null,"Auditoría Financiera "]
[]
[]
[null,null,"CHUM-1003",null,{"$f":"MAX(C19:E19)","v":0},null,"CHUM-1013",null,{"$f":"MAX(G19:I19)","v":0},null,null,null,"TPCO-1203",null,{"$f":"MAX(M19:O19)","v":0},null,"TCFV-1223",null,{"$f":"MAX(Q19:S19)","v":0},null,"TCFV-1033",null,{"$f":"MAX(U19:W19)","v":0},null,null,null,"CBAS-1133",null,{"$f":"MAX(AA19:AC19)","v":0}]
[null,null,"Desarrollo de Pensamiento ",null,null,null,"Ética y Cultura Ciudadana ",null,null,null,null,null,"Fundamentos Contables",null,null,null,"Informes Contables ",null,null,null,"Matemática Financiera Aplicada ",null,null,null,null,null,"Cálculo Aplicado"]
[]
[]
[null,null,"CBAS-1153",null,{"$f":"MAX(C23:E23)","v":0},null,"DDIN-1003",null,{"$f":"MAX(G23:I23)","v":0},null,null,null,"TCFV-1043",null,{"$f":"MAX(M23:O23)","v":0},null,"TCFV-1263",null,{"$f":"MAX(Q23:S23)","v":0},null,"TCFV-1083",null,{"$f":"MAX(U23:W23)","v":0},null,null,null,"TPCO-1243",null,{"$f":"MAX(AA23:AC23)","v":0}]
[null,null,"Fundamentación Matemática ",null,null,null,"Ideas para Emprendimiento ",null,null,null,null,null,"Normas Legales ",null,null,null,"Presupuesto",null,null,null,"Procesos Administrativos ",null,null,null,null,null,"Liquidación Pago Personal"]
[]
[]
[null,null,"CHUL-1014",null,{"$f":"MAX(C27:E27)","v":0},null,"CHUL-1024",null,{"$f":"MAX(G27:I27)","v":0},null,null,null,"TPCO-1223",null,{"$f":"MAX(M27:O27)","v":0},null,"TPCO-1143",null,{"$f":"MAX(Q27:S27)","v":0},null,null,null,null,null,null,null,"TPCO-1233",null,{"$f":"MAX(AA27:AC27)","v":0}]
[null,null,"Inglés I",null,null,null,"Inglés II",null,null,null,null,null,"Registro de Operaciones Contables",null,null,null,"Sistemas de Costos ",null,null,null,null,null,null,null,null,null,"Pagos Depósitos y Retiros"]
[]
[]
[null,null,"CHUL-1034",null,{"$f":"MAX(C31:E31)","v":0},null,"CHUL-1044",null,{"$f":"MAX(G31:I31)","v":0},null,null,null,"TCFV-1213",null,{"$f":"MAX(M31:O31)","v":0},null,"TSIS-1003",null,{"$f":"MAX(Q31:S31)","v":0},null,"TCFV-1053",null,{"$f":"MAX(U31:W31)","v":0},null,null,null,"CBAS-1103",null,{"$f":"MAX(AA31:AC31)","v":0}]
[null,null,"Inglés III",null,null,null,"Inglés IV",null,null,null,null,null,"Análisis Financieros",null,null,null,"Herramientas Ofimáticas",null,null,null,"Práctica Laboral Tecnólogo",null,null,null,null,null,"Cátedra Desarrollo Universitario"]
[]
[]
[null,null,"DDIN-1023",null,{"$f":"MAX(C36:E36)","v":0},null,"DDIN-1013",null,{"$f":"MAX(G36:I36)","v":0},null,null,null,"TCFV-1273",null,{"$f":"MAX(M36:O36)","v":0},null,"TPCO-1263",null,{"$f":"MAX(Q36:S36)","v":0}]
[null,null,"Investigación Exploratoria ",null,null,null,"Investigación Descriptiva",null,null,null,null,null,"Procedimientos de Control ",null,null,null,"Sistemas de Información Aplicado"]
[null,null,null,null,null,null,null,null,null,null,null,null,null,null,null,null,null,null,null,null,null,null,null,null,null,4,"Módulo aprobado"]
[null,null,null,null,null,null,null,null,null,null,null,null,null,null,null,null,null,null,null,null,null,null,null,null,null,2,"Módulo reprobado"]
[null,null,null,null,null,null,null,null,null,null,null,null,null,null,null,null,null,null,null,null,null,null,null,null,null,0,"Módulo pendiente por cursar"]

{"sheet":"Prerrequisitos","index":1,"n_rows":39,"n_cols":24,"rows_kept":39,"cut":false,"hidden":false,"merged":[[32,23,34,28],[36,23,38,28],[12,23,14,28],[16,23,18,28],[20,23,22,28],[24,23,26,28],[28,23,30,28],[13,12,13,14],[9,1,9,29],[12,12,12,13],[28,12,28,13],[12,6,12,7],[13,6,13,8],[21,12,21,14],[25,12,25,14],[20,12,20,13],[24,12,24,13],[16,12,16,13],[17,12,17,14],[20,6,20,7],[16,6,16,7],[17,6,17,8],[21,6,21,8],[24,6,24,7],[25,6,25,8],[28,6,28,7],[32,6,32,7],[33,6,33,8],[36,6,36,7],[37,6,37,8],[29,12,29,14],[33,12,33,14],[37,12,37,14],[32,12,32,13],[36,12,36,13],[29,6,29,8]]}
[]
[]
[]
[]
[]
[]
[]
[]
[]
[null,"Lleva el control de tu avance curricular"]
[]
[]
[null,null,null,null,null,null,"CBAS-1153",null,{"$f":"MAX(G15:I15)","v":0},null,null,null,"CBAS-1123",null,{"$f":"MAX(M15:O15)","v":0},null,null,null,null,null,null,null,null,{"$f":"IF(OR(AND(ISNUMBER(G15),G15>=3),AND(ISNUMBER(H15),H15>=3),AND(ISNUMBER(I15),I15>=3)),\"Puede cursar Aplicaciones Matemáticas\",\"Tiene pendiente por aprobar Fundamentación Matemática.\")","v":"Tiene pendiente por aprobar Fundamentación Matemática."}]
[null,null,null,null,null,null,"Fundamentación Matemática",null,null,null,null,null,"Aplicaciones Matemáticas "]
[null,null,null,null,null,null,{"$f":"IF('TGCF 2016'!C23=\"\",\"\",'TGCF 2016'!C23)","v":""},{"$f":"IF('TGCF 2016'!D23=\"\",\"\",'TGCF 2016'!D23)","v":""},{"$f":"IF('TGCF 2016'!E23=\"\",\"\",'TGCF 2016'!E23)","v":""},null,null,null,{"$f":"IF('TGCF 2016'!G15=\"\",\"\",'TGCF 2016'!G15)","v":""},{"$f":"IF('TGCF 2016'!H15=\"\",\"\",'TGCF 2016'!H15)","v":""},{"$f":"IF('TGCF 2016'!I15=\"\",\"\",'TGCF 2016'!I15)","v":""}]
[]
[null,null,null,null,null,null,"CHUL-1014",null,{"$f":"MAX(G19:I19)","v":0},null,null,null,"CHUL-1024",null,{"$f":"MAX(M19:O19)","v":0},null,null,null,null,null,null,null,null,{"$f":"IF(OR(AND(ISNUMBER(G19),G19>=3),AND(ISNUMBER(H19),H19>=3),AND(ISNUMBER(I19),I19>=3)),\"Puede cursar Inglés II\",\"Tiene pendiente por aprobar Inglés I.\")","v":"Tiene pendiente por aprobar Inglés I."}]
[null,null,null,null,null,null,"Inglés I",null,null,null,null,null,"Inglés II"]
[null,null,null,null,null,null,{"$f":"IF('TGCF 2016'!C27=\"\",\"\",'TGCF 2016'!C27)","v":""},{"$f":"IF('TGCF 2016'!D27=\"\",\"\",'TGCF 2016'!D27)","v":""},{"$f":"IF('TGCF 2016'!E27=\"\",\"\",'TGCF 2016'!E27)","v":""},null,null,null,{"$f":"IF('TGCF 2016'!G27=\"\",\"\",'TGCF 2016'!G27)","v":""},{"$f":"IF('TGCF 2016'!H27=\"\",\"\",'TGCF 2016'!H27)","v":""},{"$f":"IF('TGCF 2016'!I27=\"\",\"\",'TGCF 2016'!I27)","v":""}]
[]
[null,null,null,null,null,null,"CHUL-1024",null,{"$f":"MAX(G23:I23)","v":0},null,null,null,"CHUL-1034",null,{"$f":"MAX(M23:O23)","v":0},null,null,null,null,null,null,null,null,{"$f":"IF(OR(AND(ISNUMBER(G23),G23>=3),AND(ISNUMBER(H23),H23>=3),AND(ISNUMBER(I23),I23>=3)),\"Puede cursar Inglés III\",\"Tiene pendiente por aprobar Inglés II.\")","v":"Tiene pendiente por aprobar Inglés II."}]
[null,null,null,null,null,null,"Inglés II",null,null,null,null,null,"Inglés III"]
[null,null,null,null,null,null,{"$f":"IF('TGCF 2016'!G27=\"\",\"\",'TGCF 2016'!G27)","v":""},{"$f":"IF('TGCF 2016'!H27=\"\",\"\",'TGCF 2016'!H27)","v":""},{"$f":"IF('TGCF 2016'!I27=\"\",\"\",'TGCF 2016'!I27)","v":""},null,null,null,{"$f":"IF('TGCF 2016'!C31=\"\",\"\",'TGCF 2016'!C31)","v":""},{"$f":"IF('TGCF 2016'!D31=\"\",\"\",'TGCF 2016'!D31)","v":""},{"$f":"IF('TGCF 2016'!E31=\"\",\"\",'TGCF 2016'!E31)","v":""}]
[]
[null,null,null,null,null,null,"CHUL-1034",null,{"$f":"MAX(G27:I27)","v":0},null,null,null,"CHUL-1044",null,{"$f":"MAX(M27:O27)","v":0},null,null,null,null,null,null,null,null,{"$f":"IF(OR(AND(ISNUMBER(G27),G27>=3),AND(ISNUMBER(H27),H27>=3),AND(ISNUMBER(I27),I27>=3)),\"Puede cursar Inglés IV\",\"Tiene pendiente por aprobar Inglés III.\")","v":"Tiene pendiente por aprobar Inglés III."}]
[null,null,null,null,null,null,"Inglés III",null,null,null,null,null,"Inglés IV"]
[null,null,null,null,null,null,{"$f":"IF('TGCF 2016'!C31=\"\",\"\",'TGCF 2016'!C31)","v":""},{"$f":"IF('TGCF 2016'!D31=\"\",\"\",'TGCF 2016'!D31)","v":""},{"$f":"IF('TGCF 2016'!E31=\"\",\"\",'TGCF 2016'!E31)","v":""},null,null,null,{"$f":"IF('TGCF 2016'!G31=\"\",\"\",'TGCF 2016'!G31)","v":""},{"$f":"IF('TGCF 2016'!H31=\"\",\"\",'TGCF 2016'!H31)","v":""},{"$f":"IF('TGCF 2016'!I31=\"\",\"\",'TGCF 2016'!I31)","v":""}]
[]
[null,null,null,null,null,null,"DDIN-1023",null,{"$f":"MAX(G31:I31)","v":0},null,null,null,"DDIN-1013",null,{"$f":"MAX(M31:O31)","v":0},null,null,null,null,null,null,null,null,{"$f":"IF(OR(AND(ISNUMBER(G31),G31>=3),AND(ISNUMBER(H31),H31>=3),AND(ISNUMBER(I31),I31>=3)),\"Puede cursar Investigación Descriptiva\",\"Tiene pendiente por aprobar Investigación Exploratoria.\")","v":"Tiene pendiente por aprobar Investigación Exploratoria."}]
[null,null,null,null,null,null,"Investigación Exploratoria ",null,null,null,null,null,"Investigación Descriptiva"]
[null,null,null,null,null,null,{"$f":"IF('TGCF 2016'!C36=\"\",\"\",'TGCF 2016'!C36)","v":""},{"$f":"IF('TGCF 2016'!D36=\"\",\"\",'TGCF 2016'!D36)","v":""},{"$f":"IF('TGCF 2016'!E36=\"\",\"\",'TGCF 2016'!E36)","v":""},null,null,null,{"$f":"IF('TGCF 2016'!G36=\"\",\"\",'TGCF 2016'!G36)","v":""},{"$f":"IF('TGCF 2016'!H36=\"\",\"\",'TGCF 2016'!H36)","v":""},{"$f":"IF('TGCF 2016'!I36=\"\",\"\",'TGCF 2016'!I36)","v":""}]
[]
[null,null,null,null,null,null,"CBAS-1153",null,{"$f":"MAX(G35:I35)","v":0},null,null,null,"TCFV-1033",null,{"$f":"MAX(M35:O35)","v":0},null,null,null,null,null,null,null,null,{"$f":"IF(OR(AND(ISNUMBER(G35),G35>=3),AND(ISNUMBER(H35),H35>=3),AND(ISNUMBER(I35),I35>=3)),\"Puede cursar Matemática Financiera Aplicada\",\"Tiene pendiente por aprobar Fundamentación Matemática.\")","v":"Tiene pendiente por aprobar Fundamentación Matemática."}]
[null,null,null,null,null,null,"Fundamentación Matemática",null,null,null,null,null,"Matemática Financiera Aplicada "]
[null,null,null,null,null,null,{"$f":"IF('TGCF 2016'!C23=\"\",\"\",'TGCF 2016'!C23)","v":""},{"$f":"IF('TGCF 2016'!D23=\"\",\"\",'TGCF 2016'!D23)","v":""},{"$f":"IF('TGCF 2016'!E23=\"\",\"\",'TGCF 2016'!E23)","v":""},null,null,null,{"$f":"IF('TGCF 2016'!U19=\"\",\"\",'TGCF 2016'!U19)","v":""},{"$f":"IF('TGCF 2016'!V19=\"\",\"\",'TGCF 2016'!V19)","v":""},{"$f":"IF('TGCF 2016'!W19=\"\",\"\",'TGCF 2016'!W19)","v":""}]
[]
[null,null,null,null,null,null,"CBAS-1153",null,{"$f":"MAX(G39:I39)","v":0},null,null,null,"CBAS-1133",null,{"$f":"MAX(M39:O39)","v":0},null,null,null,null,null,null,null,null,{"$f":"IF(OR(AND(ISNUMBER(G39),G39>=3),AND(ISNUMBER(H39),H39>=3),AND(ISNUMBER(I39),I39>=3)),\"Puede cursar Cálculo Aplicado\",\"Tiene pendiente por aprobar Fundamentación Matemática.\")","v":"Tiene pendiente por aprobar Fundamentación Matemática."}]
[null,null,null,null,null,null,"Fundamentación Matemática",null,null,null,null,null,"Cálculo Aplicado"]
[null,null,null,null,null,null,{"$f":"IF('TGCF 2016'!C23=\"\",\"\",'TGCF 2016'!C23)","v":""},{"$f":"IF('TGCF 2016'!D23=\"\",\"\",'TGCF 2016'!D23)","v":""},{"$f":"IF('TGCF 2016'!E23=\"\",\"\",'TGCF 2016'!E23)","v":""},null,null,null,{"$f":"IF('TGCF 2016'!AA19=\"\",\"\",'TGCF 2016'!AA19)","v":""},{"$f":"IF('TGCF 2016'!AB19=\"\",\"\",'TGCF 2016'!AB19)","v":""},{"$f":"IF('TGCF 2016'!AC19=\"\",\"\",'TGCF 2016'!AC19)","v":""}]

{"sheet":"Cómo voy","index":2,"n_rows":41,"n_cols":23,"rows_kept":41,"cut":false,"hidden":false,"merged":[[36,15,36,18],[34,15,34,18],[22,3,22,6],[23,3,23,6],[24,3,24,6],[25,3,25,6],[22,15,22,18],[23,15,23,18],[17,3,17,6],[20,3,20,6],[19,15,19,18],[20,15,20,18],[21,15,21,18],[14,15,14,18],[15,15,15,18],[16,15,16,18],[17,15,17,18],[18,15,18,18],[13,15,13,18],[9,1,9,24],[34,19,34,20],[29,7,29,8],[21,3,21,6],[18,3,18,6],[19,3,19,6],[12,15,12,18],[12,7,12,8],[12,19,12,20],[12,3,12,6],[13,3,13,6],[14,3,14,6],[15,3,15,6],[16,3,16,6],[29,3,29,6],[40,3,40,7],[27,15,27,18],[27,19,27,20],[30,15,30,18],[31,15,31,18],[39,3,39,7],[38,3,38,7],[30,3,30,6],[31,3,31,6],[32,3,32,6],[33,3,33,6],[34,3,34,6],[28,15,28,18],[29,15,29,18],[32,15,32,18],[35,15,35,18]]}
[]
[]
[]
[]
[]
[]
[]
[]
[]
[null,"Lleva el control de tu avance curricular"]
[]
[]
[null,null,"Código","Módulo",null,null,null,"Prerrequisitos",null,"Créditos ","Estado",null,null,null,"Código","Módulo",null,null,null,"Prerrequisitos",null,"Créditos ","Estado"]
[null,null,"CBAS-1103","Catedra Desarrollo Universitario",null,null,null,null,null,0,{"$f":"MAX('TGCF 2016'!AA31:AC31)","v":0},null,null,null,"TPCO-1203","Fundamentos Contables",null,null,null,null,null,3,{"$f":"MAX('TGCF 2016'!M19:O19)","v":0}]
[null,null,"CBAS-1153","Fundamentación Matemática ",null,null,null,null,null,4,{"$f":"MAX('TGCF 2016'!C23:E23)","v":0},null,null,null,"TPOT-1013","Análisis de Precios y Mercados",null,null,null,null,null,3,{"$f":"MAX('TGCF 2016'!M15:O15)","v":0}]
[null,null,"CBAS-1113","Aplicaciones Estadísticas ",null,null,null,null,null,4,{"$f":"MAX('TGCF 2016'!C15:E15)","v":0},null,null,null,"TPCO-1213","Control de Inventarios ",null,null,null,null,null,3,{"$f":"MAX('TGCF 2016'!U15:W15)","v":0}]
[null,null,"CBAS-1123","Aplicaciones Matemáticas ",null,null,null,"CBAS-1153",{"$f":"MAX('TGCF 2016'!C23:E23)","v":0},4,{"$f":"MAX('TGCF 2016'!G15:I15)","v":0},null,null,null,"TPCO-1223","Registro de Operaciones Contables",null,null,null,null,null,3,{"$f":"MAX('TGCF 2016'!M27:O27)","v":0}]
[null,null,"CHUM-1013","Ética y Cultura Ciudadana ",null,null,null,null,null,2,{"$f":"MAX('TGCF 2016'!G19:I19)","v":0},null,null,null,"TCFV-1043","Normas Legales ",null,null,null,null,null,4,{"$f":"MAX('TGCF 2016'!M23:O23)","v":0}]
[null,null,"DDIN-1003","Ideas para Emprendimiento ",null,null,null,null,null,2,{"$f":"MAX('TGCF 2016'!G23:I23)","v":0},null,null,null,"TCFV-1083","Procesos Administrativos ",null,null,null,null,null,4,{"$f":"MAX('TGCF 2016'!U23:W23)","v":0}]
[null,null,"CHUM-1003","Desarrollo de Pensamiento ",null,null,null,null,null,2,{"$f":"MAX('TGCF 2016'!C19:E19)","v":0},null,null,null,"TCFV-1263","Presupuesto",null,null,null,null,null,3,{"$f":"MAX('TGCF 2016'!Q23:S23)","v":0}]
[null,null,"CHUL-1014","Inglés I",null,null,null,null,null,2,{"$f":"MAX('TGCF 2016'!C27:E27)","v":0},null,null,null,"TCFV-1223","Informes Contables ",null,null,null,null,null,3,{"$f":"MAX('TGCF 2016'!Q19:S19)","v":0}]
[null,null,"CHUL-1024","Inglés II",null,null,null,"CHUL-1014",{"$f":"MAX('TGCF 2016'!C27:E27)","v":0},2,{"$f":"MAX('TGCF 2016'!G27:I27)","v":0},null,null,null,"TPCO-1143","Sistemas de Costos ",null,null,null,null,null,4,{"$f":"MAX('TGCF 2016'!Q27:S27)","v":0}]
[null,null,"CHUL-1034","Inglés III",null,null,null,"CHUL-1024",{"$f":"MAX('TGCF 2016'!G27:I27)","v":0},2,{"$f":"MAX('TGCF 2016'!C31:E31)","v":0},null,null,null,"TPCO-1253","Aplicaciones Tributarias ",null,null,null,null,null,3,{"$f":"MAX('TGCF 2016'!Q15:S15)","v":0}]
[null,null,"CHUL-1044","Inglés IV",null,null,null,"CHUL-1034",{"$f":"MAX('TGCF 2016'!C31:E31)","v":0},2,{"$f":"MAX('TGCF 2016'!G31:I31)","v":0},null,null,null,"TCFV-1033","Matemática Financiera Aplicada ",null,null,null,"CBAS-1153",{"$f":"MAX('TGCF 2016'!C23:E23)","v":0},3,{"$f":"MAX('TGCF 2016'!U19:W19)","v":0}]
[null,null,"DDIN-1023","Investigación Exploratoria ",null,null,null,null,null,2,{"$f":"MAX('TGCF 2016'!C36:E36)","v":0}]
[null,null,"DDIN-1013","Investigación Descriptiva ",null,null,null,"DDIN-1023",{"$f":"MAX('TGCF 2016'!C36:E36)","v":0},2,{"$f":"MAX('TGCF 2016'!G36:I36)","v":0}]
[]
[null,null,null,null,null,null,null,null,null,null,null,null,null,null,"Código","Módulo",null,null,null,"Prerrequisitos",null,"Créditos ","Estado"]
[null,null,null,null,null,null,null,null,null,null,null,null,null,null,"TPCO-1233","Pagos Depósitos y Retiros",null,null,null,null,null,3,{"$f":"MAX('TGCF 2016'!AA27:AC27)","v":0}]
[null,null,"Código","Módulo",null,null,null,"Prerrequisitos",null,"Créditos ","Estado",null,null,null,"TPCO-1243","Liquidación Pago Personal",null,null,null,null,null,3,{"$f":"MAX('TGCF 2016'!AA23:AC23)","v":0}]
[null,null,"TSIS-1003","Herramientas Ofimáticas",null,null,null,null,null,4,{"$f":"MAX('TGCF 2016'!Q31:S31)","v":0}]
[null,null,"TCFV-1273","Procedimientos de Control ",null,null,null,null,null,3,{"$f":"MAX('TGCF 2016'!M36:O36)","v":0}]
[null,null,"TPCO-1263","Sistemas de Información Aplicado",null,null,null,null,null,4,{"$f":"MAX('TGCF 2016'!Q36:S36)","v":0}]
[null,null,"TCFV-1213","Análisis Financieros",null,null,null,null,null,3,{"$f":"MAX('TGCF 2016'!M31:O31)","v":0}]
[null,null,"TCFV-1053","Práctica Laboral Tecnólogo",null,null,null,null,null,9,{"$f":"MAX('TGCF 2016'!U31:W31)","v":0},null,null,null,"Código","Módulo",null,null,null,"Prerrequisitos",null,"Créditos ","Estado"]
[null,null,null,null,null,null,null,null,null,null,null,null,null,null,"TCFV-1003","Auditoría Financiera ",null,null,null,null,null,3,{"$f":"MAX('TGCF 2016'!AA15:AC15)","v":0}]
[null,null,null,null,null,null,null,null,null,null,null,null,null,null,"CBAS-1133","Cálculo Aplicado",null,null,null,"CBAS-1153",{"$f":"MAX('TGCF 2016'!C23:E23)","v":0},3,{"$f":"MAX('TGCF 2016'!AA19:AC19)","v":0}]
[]
[null,null,4,"Módulo / Prerrequisito aprobado"]
[null,null,2,"Módulo / Prerrequisito reprobado"]
[null,null,0,"Módulo / Prerrequisito pendiente por cursar"]